?   	chat-agent-system/cmd/artifact-vault	[no test files]
ok  	chat-agent-system/cmd/bizdev-cli	(cached)
?   	chat-agent-system/cmd/dataset	[no test files]
ok  	chat-agent-system/cmd/document-content-reconcile	(cached)
?   	chat-agent-system/cmd/document-revision-backfill	[no test files]
?   	chat-agent-system/cmd/eventmode	[no test files]
?   	chat-agent-system/cmd/events	[no test files]
?   	chat-agent-system/cmd/recategorize	[no test files]
?   	chat-agent-system/cmd/server	[no test files]
ok  	chat-agent-system/internal/agent	(cached)
ok  	chat-agent-system/internal/agentx	(cached)
ok  	chat-agent-system/internal/agentx/abtest	0.002s
ok  	chat-agent-system/internal/agentx/llm	(cached)
ok  	chat-agent-system/internal/agentx/session	(cached)
ok  	chat-agent-system/internal/agentx/tools	(cached)
ok  	chat-agent-system/internal/app	(cached)
ok  	chat-agent-system/internal/app/chatflow	(cached)
ok  	chat-agent-system/internal/app/docadvance	(cached)
ok  	chat-agent-system/internal/app/docflow	(cached)
ok  	chat-agent-system/internal/app/docnotify	(cached)
ok  	chat-agent-system/internal/app/docproject	(cached)
ok  	chat-agent-system/internal/app/fav	(cached)
ok  	chat-agent-system/internal/app/intentflow	(cached)
ok  	chat-agent-system/internal/app/stageflow	(cached)
ok  	chat-agent-system/internal/app/uow	(cached)
--- FAIL: TestArchitectureBoundaries (0.17s)
    arch_test.go:32: archtest findings=44 excepted=21 unmatched=23
          import=23
          sql_write=5
          path=16
          event=0
        REGRESSION import: 23 > baseline 0
        NEW import app/docnotify internal/app/docnotify/chat_notice.go ctxmgr (production import app/docnotify -> ctxmgr)
        NEW import app/docnotify internal/app/docnotify/consumer.go ctxmgr (production import app/docnotify -> ctxmgr)
        NEW import app/docnotify internal/app/docnotify/subscriber.go ctxmgr (production import app/docnotify -> ctxmgr)
        NEW import app internal/app/app.go workflowscope (production import app -> workflowscope)
        NEW import bizdev internal/bizdev/materials.go materialindex (production import bizdev -> materialindex)
        NEW import bizdev internal/bizdev/parts.go materialindex (production import bizdev -> materialindex)
        NEW import bizdev internal/bizdev/service.go materialindex (production import bizdev -> materialindex)
        NEW import coordinator internal/coordinator/engine.go workflowscope (production import coordinator -> workflowscope)
        NEW import docgov internal/docgov/materialize.go workflowdef (production import docgov -> workflowdef)
        NEW import docgov internal/docgov/workflow_doc_collapse.go workflowdef (production import docgov -> workflowdef)
        NEW import intent internal/intent/doc_workflow_scope.go workflowdef (production import intent -> workflowdef)
        NEW import intent internal/intent/doc_workflow_scope.go workflowscope (production import intent -> workflowscope)
        NEW import materialindex internal/materialindex/pipeline.go materialindex (package missing from import allowlist)
        NEW import mineru internal/mineru/agent.go mineru (package missing from import allowlist)
        NEW import mineru internal/mineru/client.go mineru (package missing from import allowlist)
        NEW import mineru internal/mineru/extract.go mineru (package missing from import allowlist)
        NEW import server internal/server/asset_handlers.go materialindex (production import server -> materialindex)
        NEW import server internal/server/asset_handlers.go mineru (production import server -> mineru)
        NEW import server internal/server/chat_document_reader.go workflowscope (production import server -> workflowscope)
        NEW import server internal/server/project_doc_handlers.go workflowscope (production import server -> workflowscope)
        NEW import workflowscope internal/workflowscope/flags.go workflowscope (package missing from import allowlist)
        NEW import workflowscope internal/workflowscope/relation.go workflowscope (package missing from import allowlist)
        NEW import workflowscope internal/workflowscope/score.go workflowscope (package missing from import allowlist)
        BASELINE path agent internal/agent/piagent.go output.md (string literal output.md)
        BASELINE path agent internal/agent/pinative.go output.md (string literal output.md)
        BASELINE path bizdev internal/bizdev/service.go data/dev (string literal data/dev)
        BASELINE path bizdev internal/bizdev/service.go output.md (filepath.Join/path.Join)
        BASELINE path coordinator internal/coordinator/context.go output.md (filepath.Join/path.Join)
        BASELINE path coordinator internal/coordinator/dialogue_llm.go data/dev (string literal data/dev)
        BASELINE path coordinator internal/coordinator/document_summary.go data/dev (string literal data/dev)
        BASELINE path coordinator internal/coordinator/engine.go output.md (filepath.Join/path.Join)
        BASELINE path docgov internal/docgov/lease.go output.md (filepath.Join/path.Join)
        BASELINE path docgov internal/docgov/project_docs.go output.md (filepath.Join/path.Join)
        BASELINE path docrevision internal/docrevision/projection.go output.md (filepath.Join/path.Join)
        BASELINE path docrevision internal/docrevision/reconcile.go output.md (filepath.Join/path.Join)
        BASELINE path server internal/server/document_revision_access.go output.md (filepath.Join/path.Join)
        BASELINE path server internal/server/document_revision_handlers.go output.md (string literal output.md)
        BASELINE path server internal/server/server.go workspaces/ (string literal workspaces/)
        BASELINE path storage internal/storage/cas.go data/dev (string literal data/dev)
        BASELINE sql_write docduty internal/docduty/revoke.go document_records (update writes document_records)
        BASELINE sql_write docduty internal/docduty/store.go document_records (update writes document_records)
        BASELINE sql_write docrevision internal/docrevision/pg_store.go document_records (update writes document_records)
        BASELINE sql_write docrevision internal/docrevision/pg_store.go freeform_documents (update writes freeform_documents)
        BASELINE sql_write projectinstance internal/projectinstance/store.go task_runs (update writes task_runs)
        
FAIL
FAIL	chat-agent-system/internal/archtest	0.171s
ok  	chat-agent-system/internal/artifactvault	(cached)
ok  	chat-agent-system/internal/auth	(cached)
ok  	chat-agent-system/internal/authz	(cached)
ok  	chat-agent-system/internal/bizdev	(cached)
ok  	chat-agent-system/internal/chat	(cached)
ok  	chat-agent-system/internal/config	(cached)
ok  	chat-agent-system/internal/coordinator	(cached)
ok  	chat-agent-system/internal/ctxmgr	(cached)
ok  	chat-agent-system/internal/dataset	(cached)
ok  	chat-agent-system/internal/db	(cached)
ok  	chat-agent-system/internal/doccontent	(cached)
ok  	chat-agent-system/internal/docduty	(cached)
--- FAIL: TestDocGov_CreateOrGetDocument_OptionalDutiesNullFK (0.00s)
    engine_db_test.go:135: CreateOrGetDocument with reviewer/approver=0 failed: persist document ledger: ERROR: insert or update on table "document_records" violates foreign key constraint "document_records_project_id_fkey" (SQLSTATE 23503)
FAIL
FAIL	chat-agent-system/internal/docgov	0.020s
ok  	chat-agent-system/internal/docquery	(cached)
ok  	chat-agent-system/internal/docrevision	(cached)
ok  	chat-agent-system/internal/events	0.004s
ok  	chat-agent-system/internal/freedoc	(cached)
ok  	chat-agent-system/internal/fsutil	(cached)
ok  	chat-agent-system/internal/httpx	(cached)
ok  	chat-agent-system/internal/intent	(cached)
ok  	chat-agent-system/internal/kb	(cached)
ok  	chat-agent-system/internal/materialindex	(cached)
ok  	chat-agent-system/internal/maturity	(cached)
ok  	chat-agent-system/internal/mineru	(cached)
2026/09/21 15:09:16 goose: no migrations to run. current version: 62
--- FAIL: TestPG_StageAdvanceReminder24h (0.01s)
    reminder_test.go:29: insert project: ERROR: duplicate key value violates unique constraint "uq_projects_name_global" (SQLSTATE 23505)
2026/09/21 15:09:16 goose: no migrations to run. current version: 62
--- FAIL: TestPG_EmitStageReadyDedupe (0.01s)
    service_test.go:57: insert project: ERROR: duplicate key value violates unique constraint "uq_projects_name_global" (SQLSTATE 23505)
FAIL
FAIL	chat-agent-system/internal/notification	0.018s
?   	chat-agent-system/internal/observability	[no test files]
ok  	chat-agent-system/internal/projectcontext	(cached)
ok  	chat-agent-system/internal/projectinstance	(cached)
ok  	chat-agent-system/internal/projectworkflow	(cached)
ok  	chat-agent-system/internal/quote	(cached)
ok  	chat-agent-system/internal/replyexport	(cached)
ok  	chat-agent-system/internal/server	(cached)
ok  	chat-agent-system/internal/squad	(cached)
--- FAIL: TestCAS_DatabaseIntegration (0.00s)
    cas_db_test.go:55: insert project failed: ERROR: duplicate key value violates unique constraint "uq_projects_name_global" (SQLSTATE 23505)
FAIL
FAIL	chat-agent-system/internal/storage	0.007s
ok  	chat-agent-system/internal/stream	(cached)
ok  	chat-agent-system/internal/stream/transport	(cached)
ok  	chat-agent-system/internal/swboot	(cached)
ok  	chat-agent-system/internal/sysadmin	(cached)
ok  	chat-agent-system/internal/taskrun	(cached)
ok  	chat-agent-system/internal/template	(cached)
ok  	chat-agent-system/internal/traceimpact	(cached)
ok  	chat-agent-system/internal/upload	(cached)
?   	chat-agent-system/internal/workflow	[no test files]
ok  	chat-agent-system/internal/workflow/runtime	(cached)
ok  	chat-agent-system/internal/workflowdef	(cached)
ok  	chat-agent-system/internal/workflowscope	(cached)
ok  	chat-agent-system/internal/workspace	(cached)
?   	chat-agent-system/templates	[no test files]
FAIL
TEST_EXIT:1
